hasClinicalStudy
type: ObjectProperty
inverse of: isClinicalStudyFor
domain: ChemicalConcept
domain: PlantConcept
range: ClinicalTrial
comment: Links therapies to clinical study results

hasCompound
type: ObjectProperty
inverse of: isDerivedFrom
domain: Plant
range: ChemicalConcept
comment: Links a plant to its active compound(s)

interactsWith
type: ObjectProperty
domain: ChemicalConcept
range: ChemicalConcept
range: TherapeuticEffect
comment: Describes interactions between compounds or drugs

isAssociatedWith
type: ObjectProperty
domain: PlantConcept
range: TherapeuticEffect
comment: Links plants or compounds to geographic regions

isDerivedFrom
type: ObjectProperty
domain: ChemicalConcept
range: Plant
comment: Indicates the source plant for a compound

targetsPathway
type: ObjectProperty
domain: ChemicalConcept
domain: PlantConcept
range: Pathway
comment: Links a compound to the biological pathway it affects

hasATC
type: DatatypeProperty
domain: ChemicalConcept
comment: ATC code of a chemical

hasCommonName
type: DatatypeProperty
domain: Plant
range: string
comment: The common name of a plant

hasDosage
type: DatatypeProperty
domain: ChemicalConcept
comment: Dosage information for a therapy

hasIUPACName
type: DatatypeProperty
domain: ChemicalConcept
comment: A compound's IUPAC name

hasMolecularWeight
type: DatatypeProperty
domain: ChemicalConcept
range: float
comment: The molecular weight of a compound

hasSMILES
type: DatatypeProperty
domain: ChemicalConcept
range: string
comment: The SMILES representation of a compound's structure

hasSource
type: DatatypeProperty
comment: Paper or database from which information originated

hasTherapeuticClass
type: DatatypeProperty
domain: ChemicalConcept
range: string
comment: The therapeutic class (e.g., anti-inflammatory)

topDataProperty
comment: Absorption rate of the compound in the human body
comment: hasAbsorptionRate